BDBM50173998 1-aminoethyl-N-1-carboxyethyl sulfonamidate::CHEMBL196956
SMILES CC(N)S(=O)(=O)NC(C)C(O)=O
InChI Key InChIKey=HIQUFFOQZFVHEN-UHFFFAOYSA-N
Data  1 KI
  Tab Delimited (TSV)   2D SDfile   Computed 3D by Vconf -m prep SDfile
Find this compound or compounds like it in BindingDB:
Activity Spreadsheet -- Enzyme Inhibition Constant Data from BindingDB
Found 1 hit for monomerid = 50173998
TargetAminopeptidase N(Escherichia coli (strain K12))
Miami University
Curated by ChEMBL
LigandPNGBDBM50173998(1-aminoethyl-N-1-carboxyethyl sulfonamidate | CHEM...)
Affinity DataKi: >3.00E+5nM. Assay description: Inhibitory activity against aminopeptidase N (PepN) from Escherichia coli
In DepthDetails ArticlePubMed