BDBM50174055 CHEMBL198379::Diethyl-[2-(2-fluoro-phenyl)-2-(4-methyl-piperazin-1-yl)-ethyl]-amine
SMILES CCN(CC)CC(N1CCN(C)CC1)c1ccccc1F
InChI Key InChIKey=RWPANTLIFBQUPV-UHFFFAOYSA-N
Data  1 KI
  Tab Delimited (TSV)   2D SDfile   Computed 3D by Vconf -m prep SDfile
Find this compound or compounds like it in BindingDB:
Activity Spreadsheet -- Enzyme Inhibition Constant Data from BindingDB
Found 1 hit for monomerid = 50174055
TargetMelanocortin receptor 4(Homo sapiens (Human))
Eli Lilly
Curated by ChEMBL
LigandPNGBDBM50174055(CHEMBL198379 | Diethyl-[2-(2-fluoro-phenyl)-2-(4-m...)
Affinity DataKi:  20nM. Assay description: Inhibition of [125I]-NDP MSH binding to human Melanocortin 4 receptor
In DepthDetails ArticlePubMed