BDBM50174181 CHEMBL3809806
SMILES CCCCc1ccc(NC(=O)CSc2nnc([nH]2)-c2ccccc2N)cc1
InChI Key InChIKey=XWCNMIUIOIZJDM-UHFFFAOYSA-N
Data  1 KI  1 IC50
  Tab Delimited (TSV)   2D SDfile   Computed 3D by Vconf -m prep SDfile
Find this compound or compounds like it in BindingDB:
Activity Spreadsheet -- Enzyme Inhibition Constant Data from BindingDB
Found 2 hits for monomerid = 50174181
TargetMetallo-beta-lactamase type 2(Klebsiella pneumoniae)
North-West University
Curated by ChEMBL
LigandPNGBDBM50174181(CHEMBL3809806)
Affinity DataKi:  490nM. Assay description: Mixed type inhibition of Klebsiella pneumoniae metallo-beta-lactamase NDM-1 expressed in Escherichia coli BL21(DE3) cells assessed as hydrolysis of c...
In DepthDetails ArticlePubMed
TargetMetallo-beta-lactamase type 2(Klebsiella pneumoniae)
North-West University
Curated by ChEMBL
LigandPNGBDBM50174181(CHEMBL3809806)
Affinity DataIC50:  160nM. Assay description: Inhibition of Klebsiella pneumoniae metallo-beta-lactamase NDM-1 expressed in Escherichia coli BL21(DE3) cells preincubated for 60 min followed by ad...
In DepthDetails ArticlePubMed