BDBM50174310 CHEMBL3809903
SMILES Cc1ccccc1NC(=O)CSc1nnc([nH]1)-c1ccccc1N
InChI Key InChIKey=WNFPWRDKGWWFKH-UHFFFAOYSA-N
Data  1 IC50
  Tab Delimited (TSV)   2D SDfile   Computed 3D by Vconf -m prep SDfile
Find this compound or compounds like it in BindingDB:
Activity Spreadsheet -- Enzyme Inhibition Constant Data from BindingDB
Found 1 hit for monomerid = 50174310
TargetMetallo-beta-lactamase type 2(Klebsiella pneumoniae)
North-West University
Curated by ChEMBL
LigandPNGBDBM50174310(CHEMBL3809903)
Affinity DataIC50:  1.90E+3nM. Assay description: Inhibition of Klebsiella pneumoniae metallo-beta-lactamase NDM-1 expressed in Escherichia coli BL21(DE3) cells preincubated for 60 min followed by ad...
In DepthDetails ArticlePubMed