BDBM50174345 CHEMBL3809112
SMILES N[C@@H](Cc1cccc(Cc2ccccc2)c1)C(O)=O
InChI Key InChIKey=WDAJRFDYHJVFMA-HNNXBMFYSA-N
Data  2 IC50
  Tab Delimited (TSV)   2D SDfile   Computed 3D by Vconf -m prep SDfile
Find this compound or compounds like it in BindingDB:
Activity Spreadsheet -- Enzyme Inhibition Constant Data from BindingDB
Found 2 hits for monomerid = 50174345
TargetLarge neutral amino acids transporter small subunit 1(Homo sapiens (Human))
University Of California
Curated by ChEMBL
LigandPNGBDBM50174345(CHEMBL3809112)
Affinity DataIC50:  7.30E+3nM. Assay description: Cis-inhibition of human LAT1 expressed in TREx HEK293 cells at 200 uM assessed as inhibition of [3H]-gabapentin uptake preincubated for 3 mins at 37 ...
In DepthDetails ArticlePubMed
TargetLarge neutral amino acids transporter small subunit 1(Homo sapiens (Human))
University Of California
Curated by ChEMBL
LigandPNGBDBM50174345(CHEMBL3809112)
Affinity DataIC50:  7.30E+3nM. Assay description: Inhibition of human LAT1 expressed in HEK cells assessed as reduction in uptake of [3H]-gabapentin after 3 mins by scintillation counting based cis-i...
In DepthDetails ArticlePubMed