BDBM50174935 CHEMBL371688::N-(3-chloro-6-methoxypyridin-2-yl)-5-isopropoxy-7-(2-(4-methylpiperazin-1-yl)ethoxy)quinazolin-4-amine
SMILES COc1ccc(Cl)c(Nc2ncnc3cc(OCCN4CCN(C)CC4)cc(OC(C)C)c23)n1
InChI Key InChIKey=PKVYBWGFOWKFHZ-UHFFFAOYSA-N
Data  3 IC50
  Tab Delimited (TSV)   2D SDfile   Computed 3D by Vconf -m prep SDfile
Find this compound or compounds like it in BindingDB:
Activity Spreadsheet -- Enzyme Inhibition Constant Data from BindingDB
Found 3 hits for monomerid = 50174935
TargetProto-oncogene tyrosine-protein kinase Src(Homo sapiens (Human))
Astrazeneca
Curated by ChEMBL
LigandPNGBDBM50174935(CHEMBL371688 | N-(3-chloro-6-methoxypyridin-2-yl)-...)
Affinity DataIC50:  7nM. Assay description: Inhibitory activity against c-Src kinase
In DepthDetails ArticlePubMed
TargetProto-oncogene tyrosine-protein kinase Src(Homo sapiens (Human))
Astrazeneca
Curated by ChEMBL
LigandPNGBDBM50174935(CHEMBL371688 | N-(3-chloro-6-methoxypyridin-2-yl)-...)
Affinity DataIC50:  70nM. Assay description: Inhibition of Src-transfected 3T3 cell proliferation
In DepthDetails ArticlePubMed
TargetVascular endothelial growth factor receptor 2(Homo sapiens (Human))
Astrazeneca
Curated by ChEMBL
LigandPNGBDBM50174935(CHEMBL371688 | N-(3-chloro-6-methoxypyridin-2-yl)-...)
Affinity DataIC50:  570nM. Assay description: Inhibitory activity against KDR
In DepthDetails ArticlePubMed