BDBM50175024 CHEMBL3808714
SMILES CC1=C(COC1=O)N1CCC2(CCN(C[C@H](O)c3cc-4c(Cn5nnnc-45)cc3C)CC2)C1=O
InChI Key InChIKey=GNXWMDUGMWZVJO-UHFFFAOYSA-N
Data  1 IC50
  Tab Delimited (TSV)   2D SDfile   Computed 3D by Vconf -m prep SDfile
Find this compound or compounds like it in BindingDB:
Activity Spreadsheet -- Enzyme Inhibition Constant Data from BindingDB
Found 1 hit for monomerid = 50175024
TargetATP-sensitive inward rectifier potassium channel 1(Homo sapiens (Human))
Temple University
Curated by ChEMBL
LigandPNGBDBM50175024(CHEMBL3808714)
Affinity DataIC50:  17nM. Assay description: Inhibition of human Kir1.1 expressed in HEK293 cells after 30 mins by thallium flux assay
In DepthDetails ArticlePubMed