BDBM50175276 CHEMBL3809326
SMILES Cl.CCCCCCCCCCCc1ccc(cc1)-c1noc(n1)C1(CC1)C(N)=N
InChI Key InChIKey=SIGWMSCFQLHWRK-UHFFFAOYSA-N
Data  2 KI
  Tab Delimited (TSV)   2D SDfile   Computed 3D by Vconf -m prep SDfile
Find this compound or compounds like it in BindingDB:
Activity Spreadsheet -- Enzyme Inhibition Constant Data from BindingDB
Found 2 hits for monomerid = 50175276
TargetSphingosine kinase 1(Homo sapiens (Human))
University Of Virginia
Curated by ChEMBL
LigandPNGBDBM50175276(CHEMBL3809326)
Affinity DataKi:  260nM. Assay description: Inhibition of human SphK1 expressed in baculovirus infected in Sf9 cells using D-erythro-sphingosine as substrate and [gamma-32P]ATP by scintillation...
In DepthDetails ArticlePubMed
TargetSphingosine kinase 2(Homo sapiens (Human))
University Of Virginia
Curated by ChEMBL
LigandPNGBDBM50175276(CHEMBL3809326)
Affinity DataKi:  4.30E+4nM. Assay description: Inhibition of human SphK2 expressed in baculovirus infected in Sf9 cells using D-erythro-sphingosine as substrate and [gamma-32P]ATP by scintillation...
In DepthDetails ArticlePubMed