BDBM50175546 CHEMBL373285::N-Hydroxy-2-[4-(4-imidazol-1-yl-phenoxy)-piperidine-1-sulfonylamino]-acetamide
SMILES ONC(=O)CNS(=O)(=O)N1CCC(CC1)Oc1ccc(cc1)-n1ccnc1
InChI Key InChIKey=FFSKFUZCVRDIKT-UHFFFAOYSA-N
Data  1 KI
  Tab Delimited (TSV)   2D SDfile   Computed 3D by Vconf -m prep SDfile
Find this compound or compounds like it in BindingDB:
Activity Spreadsheet -- Enzyme Inhibition Constant Data from BindingDB
Found 1 hit for monomerid = 50175546
TargetInterstitial collagenase(Homo sapiens (Human))
De Novo Pharmaceuticals
Curated by ChEMBL
LigandPNGBDBM50175546(CHEMBL373285 | N-Hydroxy-2-[4-(4-imidazol-1-yl-phe...)
Affinity DataKi:  224nM. Assay description: Binding affinity towards (MMP-1) matrix metalloproteinase-1
In DepthDetails ArticlePubMed