BDBM50175553 4-(4-Fluoro-2-methyl-benzyloxy)-N-hydroxycarbamoylmethyl-benzamide::CHEMBL197931
SMILES Cc1cc(F)ccc1COc1ccc(cc1)C(=O)NCC(=O)NO
InChI Key InChIKey=VYTWLSNEGJPKHG-UHFFFAOYSA-N
Data  1 IC50
  Tab Delimited (TSV)   2D SDfile   Computed 3D by Vconf -m prep SDfile
Find this compound or compounds like it in BindingDB:
Activity Spreadsheet -- Enzyme Inhibition Constant Data from BindingDB
Found 1 hit for monomerid = 50175553
TargetInterstitial collagenase(Homo sapiens (Human))
De Novo Pharmaceuticals
Curated by ChEMBL
LigandPNGBDBM50175553(4-(4-Fluoro-2-methyl-benzyloxy)-N-hydroxycarbamoyl...)
Affinity DataIC50:  10nM. Assay description: Inhibitory concentration against (MMP-1) matrix metalloproteinase-1
In DepthDetails ArticlePubMed