BDBM50175554 4-[4-(4-Chloro-phenoxy)-phenyl]-N-hydroxy-4-oxo-butyramide::CHEMBL370416
SMILES ONC(=O)CCC(=O)c1ccc(Oc2ccc(Cl)cc2)cc1
InChI Key InChIKey=VKPDJMVPQJDZNV-UHFFFAOYSA-N
Data  1 KI
  Tab Delimited (TSV)   2D SDfile   Computed 3D by Vconf -m prep SDfile
Find this compound or compounds like it in BindingDB:
Activity Spreadsheet -- Enzyme Inhibition Constant Data from BindingDB
Found 1 hit for monomerid = 50175554
TargetInterstitial collagenase(Homo sapiens (Human))
De Novo Pharmaceuticals
Curated by ChEMBL
LigandPNGBDBM50175554(4-[4-(4-Chloro-phenoxy)-phenyl]-N-hydroxy-4-oxo-bu...)
Affinity DataKi:  70nM. Assay description: Binding affinity towards (MMP-1) matrix metalloproteinase-1
In DepthDetails ArticlePubMed