BDBM50175563 CHEMBL197729::N-Hydroxy-3-(4-prop-1-ynyloxy-benzenesulfonyl)-propionamide
SMILES CC#COc1ccc(cc1)S(=O)(=O)CCC(=O)NO
InChI Key InChIKey=IETDRXSCKOACTP-UHFFFAOYSA-N
Data  1 IC50
  Tab Delimited (TSV)   2D SDfile   Computed 3D by Vconf -m prep SDfile
Find this compound or compounds like it in BindingDB:
Activity Spreadsheet -- Enzyme Inhibition Constant Data from BindingDB
Found 1 hit for monomerid = 50175563
TargetInterstitial collagenase(Homo sapiens (Human))
De Novo Pharmaceuticals
Curated by ChEMBL
LigandPNGBDBM50175563(CHEMBL197729 | N-Hydroxy-3-(4-prop-1-ynyloxy-benze...)
Affinity DataIC50:  121nM. Assay description: Inhibitory concentration against (MMP-1) matrix metalloproteinase-1
In DepthDetails ArticlePubMed