BDBM50175692 CHEMBL370166::N-(2-aminoethyl)-4-(4-(benzo[b]thiophen-2-yl)pyrimidin-2-ylamino)benzamide
SMILES NCCNC(=O)c1ccc(Nc2nccc(n2)-c2cc3ccccc3s2)cc1
InChI Key InChIKey=SFJIDFPJXATQEW-UHFFFAOYSA-N
Data  3 IC50
  Tab Delimited (TSV)   2D SDfile   Computed 3D by Vconf -m prep SDfile
Find this compound or compounds like it in BindingDB:
Activity Spreadsheet -- Enzyme Inhibition Constant Data from BindingDB
Found 3 hits for monomerid = 50175692
LigandPNGBDBM50175692(CHEMBL370166 | N-(2-aminoethyl)-4-(4-(benzo[b]thio...)
Affinity DataIC50:  4.40E+3nM. Assay description: Inhibitory activity against IKK complex isolated from HeLa cells
In DepthDetails ArticlePubMed
TargetInhibitor of nuclear factor kappa-B kinase subunit alpha(Homo sapiens (Human))
Novartis Institutes For Biomedical Research
Curated by ChEMBL
LigandPNGBDBM50175692(CHEMBL370166 | N-(2-aminoethyl)-4-(4-(benzo[b]thio...)
Affinity DataIC50:  3.70E+3nM. Assay description: Inhibitory activity against IKK1
In DepthDetails ArticlePubMed
TargetInhibitor of nuclear factor kappa-B kinase subunit beta(Homo sapiens (Human))
Novartis Institutes For Biomedical Research
Curated by ChEMBL
LigandPNGBDBM50175692(CHEMBL370166 | N-(2-aminoethyl)-4-(4-(benzo[b]thio...)
Affinity DataIC50:  600nM. Assay description: Inhibitory activity against IKK2
In DepthDetails ArticlePubMed