BDBM50175952 8-[(cis, rac)-2-hydroxy-2-(4-methoxy-phenyl)-cyclohexyl]-1-phenyl-1,3,8-triaza-spiro[4.5]decan-4-one::CHEMBL371966
SMILES COc1ccc(cc1)[C@]1(O)CCCC[C@H]1N1CCC2(CC1)N(CNC2=O)c1ccccc1
InChI Key InChIKey=WUDAAQNUDBBHTO-ZEQKJWHPSA-N
Data  2 IC50  2 EC50
  Tab Delimited (TSV)   2D SDfile   Computed 3D by Vconf -m prep SDfile
Find this compound or compounds like it in BindingDB:
Activity Spreadsheet -- Enzyme Inhibition Constant Data from BindingDB
Found 4 hits for monomerid = 50175952
TargetSodium- and chloride-dependent glycine transporter 2(Homo sapiens (Human))
F. Hoffmann-La Roche
Curated by ChEMBL
LigandPNGBDBM50175952(8-[(cis, rac)-2-hydroxy-2-(4-methoxy-phenyl)-cyclo...)
Affinity DataEC50:  6.70E+4nM. Assay description: Displacement of [3H]glycine from human GlyT2 by radiometric assay
In DepthDetails ArticlePubMed
TargetNociceptin receptor(Homo sapiens (Human))
F. Hoffmann-La Roche
Curated by ChEMBL
LigandPNGBDBM50175952(8-[(cis, rac)-2-hydroxy-2-(4-methoxy-phenyl)-cyclo...)
Affinity DataIC50:  7.00E+3nM. Assay description: Displacement of [3H]NOP from human NOP receptor expressed in HEK293 cells
In DepthDetails ArticlePubMed
TargetMu-type opioid receptor(Homo sapiens (Human))
F. Hoffmann-La Roche
Curated by ChEMBL
LigandPNGBDBM50175952(8-[(cis, rac)-2-hydroxy-2-(4-methoxy-phenyl)-cyclo...)
Affinity DataIC50:  2.50E+3nM. Assay description: Inhibitory activity at human mu opioid receptor in BHK cells by GTPgammaS binding assay
In DepthDetails ArticlePubMed
TargetSodium- and chloride-dependent glycine transporter 1(Homo sapiens (Human))
F. Hoffmann-La Roche
Curated by ChEMBL
LigandPNGBDBM50175952(8-[(cis, rac)-2-hydroxy-2-(4-methoxy-phenyl)-cyclo...)
Affinity DataEC50:  261nM. Assay description: Displacement of [3H]glycine from human GlyT1 by radiometric assay
In DepthDetails ArticlePubMed