BDBM50176181 CHEMBL383096::N-(4-(4-(1,1,1,3,3,3-hexafluoro-2-hydroxypropan-2-yl)phenyl)-5-methylisoxazol-3-yl)hexanamide
SMILES CCCCCC(=O)Nc1noc(C)c1-c1ccc(cc1)C(O)(C(F)(F)F)C(F)(F)F
InChI Key InChIKey=XDNYVASFZXRZJI-UHFFFAOYSA-N
Data  1 IC50
  Tab Delimited (TSV)   2D SDfile   Computed 3D by Vconf -m prep SDfile
Find this compound or compounds like it in BindingDB:
Activity Spreadsheet -- Enzyme Inhibition Constant Data from BindingDB
Found 1 hit for monomerid = 50176181
TargetMalonyl-CoA decarboxylase, mitochondrial(Homo sapiens (Human))
Chugai Pharma Usa
Curated by ChEMBL
LigandPNGBDBM50176181(CHEMBL383096 | N-(4-(4-(1,1,1,3,3,3-hexafluoro-2-h...)
Affinity DataIC50:  1.20E+3nM. Assay description: Inhibitory activity against recombinant human MCD MBP fusion protein
In DepthDetails ArticlePubMed