BDBM50176311 CHEMBL201720::N-benzylquinolin-2-amine
SMILES C(Nc1ccc2ccccc2n1)c1ccccc1
InChI Key InChIKey=PBQZDVLJNWXNFO-UHFFFAOYSA-N
Data  1 Kd
  Tab Delimited (TSV)   2D SDfile   Computed 3D by Vconf -m prep SDfile
Find this compound or compounds like it in BindingDB:
Activity Spreadsheet -- Enzyme Inhibition Constant Data from BindingDB
Found 1 hit for monomerid = 50176311
TargetTyrosine-protein kinase Tec(Homo sapiens (Human))
The University Of Adelaide
Curated by ChEMBL
LigandPNGBDBM50176311(CHEMBL201720 | N-benzylquinolin-2-amine)
Affinity DataKd:  1.93E+5nM. Assay description: Binding affinity to Tec SH3 domain
In DepthDetails ArticlePubMed