BDBM50176313 CHEMBL381361::N-(2-fluorobenzyl)quinolin-2-amine
SMILES Fc1ccccc1CNc1ccc2ccccc2n1
InChI Key InChIKey=IAPXZJHFSYRYJT-UHFFFAOYSA-N
Data  1 Kd
  Tab Delimited (TSV)   2D SDfile   Computed 3D by Vconf -m prep SDfile
Find this compound or compounds like it in BindingDB:
Activity Spreadsheet -- Enzyme Inhibition Constant Data from BindingDB
Found 1 hit for monomerid = 50176313
TargetTyrosine-protein kinase Tec(Homo sapiens (Human))
The University Of Adelaide
Curated by ChEMBL
LigandPNGBDBM50176313(CHEMBL381361 | N-(2-fluorobenzyl)quinolin-2-amine)
Affinity DataKd:  2.08E+5nM. Assay description: Binding affinity to Tec SH3 domain
In DepthDetails ArticlePubMed