BDBM50176534 5-(cyclopropylmethylamino)-1-(5-(methylsulfonyl)pyridin-2-yl)-3-(trifluoromethyl)-1H-pyrazole-4-carbonitrile::CHEMBL199992
SMILES CS(=O)(=O)c1ccc(nc1)-n1nc(c(C#N)c1NCC1CC1)C(F)(F)F
InChI Key InChIKey=SYJUJXUSQXABKY-UHFFFAOYSA-N
Data  2 IC50
  Tab Delimited (TSV)   2D SDfile   Computed 3D by Vconf -m prep SDfile
Find this compound or compounds like it in BindingDB:
Activity Spreadsheet -- Enzyme Inhibition Constant Data from BindingDB
Found 2 hits for monomerid = 50176534
TargetProstaglandin G/H synthase 2(Canis familiaris)
Veterinary Medicine Research And Development Pfizer
Curated by ChEMBL
LigandPNGBDBM50176534(5-(cyclopropylmethylamino)-1-(5-(methylsulfonyl)py...)
Affinity DataIC50:  110nM. Assay description: Inhibitory activity against COX2 in canine whole blood
In DepthDetails ArticlePubMed
TargetProstaglandin G/H synthase 1(Canis familiaris)
Veterinary Medicine Research And Development Pfizer
Curated by ChEMBL
LigandPNGBDBM50176534(5-(cyclopropylmethylamino)-1-(5-(methylsulfonyl)py...)
Affinity DataIC50:  2.20E+4nM. Assay description: Inhibitory activity against COX1 in canine whole blood
In DepthDetails ArticlePubMed