BDBM50176780 CHEMBL3808931
SMILES CCCNc1nc(nc2ccccc12)N(C)c1ccc(OC)cc1
InChI Key InChIKey=IJLDJEASLDJCDS-UHFFFAOYSA-N
Data  1 IC50
  Tab Delimited (TSV)   2D SDfile   Computed 3D by Vconf -m prep SDfile
Find this compound or compounds like it in BindingDB:
Activity Spreadsheet -- Enzyme Inhibition Constant Data from BindingDB
Found 1 hit for monomerid = 50176780
TargetTyrosine-protein kinase Mer(Homo sapiens (Human))
Beijing Institute Of Pharmacology & Toxicology
Curated by ChEMBL
LigandPNGBDBM50176780(CHEMBL3808931)
Affinity DataIC50:  1.84E+3nM. Assay description: Inhibition of MERTK (unknown origin) using EFPIYDFLPAKKK-CONH2 as substrate and ATP after 180 mins by microfluidic capillary electrophoresis method
In DepthDetails ArticlePubMed