BDBM50176789 CHEMBL3809769
SMILES OCCCNc1nc(Nc2ccc(cc2)C#N)nc2ccccc12
InChI Key InChIKey=FHJDQALLIXLBIE-UHFFFAOYSA-N
Data  1 IC50
  Tab Delimited (TSV)   2D SDfile   Computed 3D by Vconf -m prep SDfile
Find this compound or compounds like it in BindingDB:
Activity Spreadsheet -- Enzyme Inhibition Constant Data from BindingDB
Found 1 hit for monomerid = 50176789
TargetTyrosine-protein kinase Mer(Homo sapiens (Human))
Beijing Institute Of Pharmacology & Toxicology
Curated by ChEMBL
LigandPNGBDBM50176789(CHEMBL3809769)
Affinity DataIC50:  1.72E+3nM. Assay description: Inhibition of MERTK (unknown origin) using EFPIYDFLPAKKK-CONH2 as substrate and ATP after 180 mins by microfluidic capillary electrophoresis method
In DepthDetails ArticlePubMed