BDBM50176861 CHEMBL3809833
SMILES OC(=O)c1cccc(c1)N1N=C(\C(=C\c2ccco2)C1=O)c1ccccc1
InChI Key InChIKey=HPJRFNJSAWHFEU-AQTBWJFISA-N
Data  1 IC50
  Tab Delimited (TSV)   2D SDfile   Computed 3D by Vconf -m prep SDfile
Find this compound or compounds like it in BindingDB:
Activity Spreadsheet -- Enzyme Inhibition Constant Data from BindingDB
Found 1 hit for monomerid = 50176861
TargetReplicase polyprotein 1ab(Human SARS coronavirus (SARS-CoV) (Severe acute re...)
Academia Sinica
Curated by ChEMBL
LigandPNGBDBM50176861(CHEMBL3809833)
Affinity DataIC50: >5.00E+4nM. Assay description: Inhibition of SARS coronavirus recombinant 3CL-PRO expressed in Escherichia coli JM109 cells using Dabcyl-KTSAVLQSGFRKME-Edans as fluorogenic substra...
In DepthDetails ArticlePubMed