BDBM50177022 CHEMBL3814424
SMILES Cl.CN(C\C=C\c1ccc(cc1)C(F)(F)F)Cc1cccc2ccoc12
InChI Key InChIKey=UMJCCCZKGYJSIX-BJILWQEISA-N
Data  7 IC50
  Tab Delimited (TSV)   2D SDfile   Computed 3D by Vconf -m prep SDfile
Find this compound or compounds like it in BindingDB:
Activity Spreadsheet -- Enzyme Inhibition Constant Data from BindingDB
Found 7 hits for monomerid = 50177022
Target4,4'-diapophytoene desaturase (4,4'-diaponeurosporene-forming)(Staphylococcus aureus (strain Newman))
East China University Of Science And Technology
Curated by ChEMBL
LigandPNGBDBM50177022(CHEMBL3814424)
Affinity DataIC50:  339nM. Assay description: Inhibition of Staphylococcus aureus Newman 6His-tagged CrtN expressed in Escherichia coli BL21(DE3) using diapophytoene as substrate assessed as pigm...
In DepthDetails ArticlePubMed
TargetPotassium voltage-gated channel subfamily H member 2(Homo sapiens (Human))
East China University Of Science And Technology
Curated by ChEMBL
LigandPNGBDBM50177022(CHEMBL3814424)
Affinity DataIC50:  3.71E+3nM. Assay description: Inhibition of human ERG expressed in CHO cells by Qpatch-clamp method
In DepthDetails ArticlePubMed
TargetPotassium voltage-gated channel subfamily H member 2(Homo sapiens (Human))
East China University Of Science And Technology
Curated by ChEMBL
LigandPNGBDBM50177022(CHEMBL3814424)
Affinity DataIC50:  3.70E+3nM. Assay description: Inhibition of human ERG expressed in CHO cells at -80 mV holding potential after 3 mins by QPatch test
In DepthDetails ArticlePubMed
Target4,4'-diapophytoene desaturase (4,4'-diaponeurosporene-forming)(Staphylococcus aureus (strain MW2))
East China University Of Science And Technology
Curated by ChEMBL
LigandPNGBDBM50177022(CHEMBL3814424)
Affinity DataIC50:  3.40nM. Assay description: Inhibition of CrtN in methicillin-resistant Staphylococcus aureus USA400 MW2 assessed as reduction in staphyloxanthin levels after 48 hrs by spectrop...
In DepthDetails ArticlePubMed
Target4,4'-diapophytoene desaturase (4,4'-diaponeurosporene-forming)(Staphylococcus aureus (strain Newman))
East China University Of Science And Technology
Curated by ChEMBL
LigandPNGBDBM50177022(CHEMBL3814424)
Affinity DataIC50:  5.5nM. Assay description: Inhibition of CrtN in methicillin-resistant Staphylococcus aureus LAC USA300 assessed as reduction in staphyloxanthin levels after 48 hrs by spectrop...
In DepthDetails ArticlePubMed
Target4,4'-diapophytoene desaturase (4,4'-diaponeurosporene-forming)(Staphylococcus aureus (strain Newman))
East China University Of Science And Technology
Curated by ChEMBL
LigandPNGBDBM50177022(CHEMBL3814424)
Affinity DataIC50:  0.400nM. Assay description: Inhibition of CrtN in methicillin-resistant Staphylococcus aureus Mu50 assessed as reduction in staphyloxanthin levels after 48 hrs by spectrophotome...
In DepthDetails ArticlePubMed
Target4,4'-diapophytoene desaturase (4,4'-diaponeurosporene-forming)(Staphylococcus aureus (strain Newman))
East China University Of Science And Technology
Curated by ChEMBL
LigandPNGBDBM50177022(CHEMBL3814424)
Affinity DataIC50:  300nM. Assay description: Inhibition of Staphylococcus aureus Newman 6His-tagged CrtN expressed in Escherichia coli BL21 (DE3)/pET28a::CrtN assessed as reduction in staphyloxa...
In DepthDetails ArticlePubMed