BDBM50177094 9-Dimethylamino-3-(2-methyl-cyclohexyl)-3H-pyrido[3',2':4,5]thieno[3,2-d]pyrimidin-4-one::9-dimethylamino-3-(2-methylcyclohexyl)-3H-5-thia-1,3,6-triazafluoren-4-one::CHEMBL224672
SMILES CC1CCCCC1n1cnc2c(sc3nccc(N(C)C)c23)c1=O
InChI Key InChIKey=DJZFVYFKKWLWNN-UHFFFAOYSA-N
Data  3 IC50
  Tab Delimited (TSV)   2D SDfile   Computed 3D by Vconf -m prep SDfile
Find this compound or compounds like it in BindingDB:
Activity Spreadsheet -- Enzyme Inhibition Constant Data from BindingDB
Found 3 hits for monomerid = 50177094
TargetMetabotropic glutamate receptor 1(Homo sapiens (Human))
Abbott Laboratories
Curated by ChEMBL
LigandPNGBDBM50177094(9-Dimethylamino-3-(2-methyl-cyclohexyl)-3H-pyrido[...)
Affinity DataIC50:  130nM. Assay description: Antagonist activity at human mGluR1 expressed in 1321N1 cells assessed as effect on L-glutamate-induced calcium mobilization
In DepthDetails ArticlePubMed
TargetMetabotropic glutamate receptor 1(RAT)
Biocampus
Curated by ChEMBL
LigandPNGBDBM50177094(9-Dimethylamino-3-(2-methyl-cyclohexyl)-3H-pyrido[...)
Affinity DataIC50:  130nM. Assay description: Inhibition of rat mGluR1
In DepthDetails ArticlePubMed
TargetMetabotropic glutamate receptor 5(Homo sapiens (Human))
Abbott Laboratories
Curated by ChEMBL
LigandPNGBDBM50177094(9-Dimethylamino-3-(2-methyl-cyclohexyl)-3H-pyrido[...)
Affinity DataIC50: >1.00E+5nM. Assay description: Antagonist activity at human mGluR5 expressed in 1321N1 cells assessed as effect on L-glutamate-induced calcium mobilization
In DepthDetails ArticlePubMed