BDBM50177179 3-(4-(4-fluorophenyl)piperazin-1-yl)-1-phenylpyrrolidine-2,5-dione::CHEMBL369996
SMILES Oc1cc(N2CCN(CC2)c2ccc(F)cc2)c(O)n1-c1ccccc1
InChI Key InChIKey=BJOIEQGOXHVTBT-UHFFFAOYSA-N
Data  1 IC50
  Tab Delimited (TSV)   2D SDfile   Computed 3D by Vconf -m prep SDfile
Find this compound or compounds like it in BindingDB:
Activity Spreadsheet -- Enzyme Inhibition Constant Data from BindingDB
Found 1 hit for monomerid = 50177179
TargetNADP-dependent malic enzyme(Homo sapiens (Human))
Cytrx Laboratories
Curated by ChEMBL
LigandPNGBDBM50177179(3-(4-(4-fluorophenyl)piperazin-1-yl)-1-phenylpyrro...)
Affinity DataIC50:  1.00E+4nM. Assay description: Inhibitory activity against cytosolic malic enzyme
In DepthDetails ArticlePubMed