BDBM50177523 CHEMBL381047::tert-butyl (1S)-1-({[(methylamino)carbonyl]hydrazono}methyl)pentylcarbamate
SMILES CCCC[C@H](NC(=O)OC(C)(C)C)C=NNC(=O)NC
InChI Key InChIKey=INDZTGJHUVGWCH-JTQLQIEISA-N
Data  1 IC50
  Tab Delimited (TSV)   2D SDfile   Computed 3D by Vconf -m prep SDfile
Find this compound or compounds like it in BindingDB:
Activity Spreadsheet -- Enzyme Inhibition Constant Data from BindingDB
Found 1 hit for monomerid = 50177523
TargetCathepsin K(Homo sapiens (Human))
Glaxosmithkline
Curated by ChEMBL
LigandPNGBDBM50177523(CHEMBL381047 | tert-butyl (1S)-1-({[(methylamino)c...)
Affinity DataIC50:  280nM. Assay description: Inhibition of recombinant human cathepsin K in a fluorescence assay
In DepthDetails ArticlePubMed