BDBM50177544 1-(4-(2-(4-((1H-imidazol-4-yl)methyl)piperidin-1-yl)ethoxy)benzyl)piperidine::CHEMBL204193
SMILES C(CN1CCC(Cc2cnc[nH]2)CC1)Oc1ccc(CN2CCCCC2)cc1
InChI Key InChIKey=DPXKDWXDGFHQTD-UHFFFAOYSA-N
Data  1 KI  1 IC50
  Tab Delimited (TSV)   2D SDfile   Computed 3D by Vconf -m prep SDfile
Find this compound or compounds like it in BindingDB:
Activity Spreadsheet -- Enzyme Inhibition Constant Data from BindingDB
Found 2 hits for monomerid = 50177544
TargetHistamine H3 receptor(GUINEA PIG)
The Schering Plough Research Institute
Curated by ChEMBL
LigandPNGBDBM50177544(1-(4-(2-(4-((1H-imidazol-4-yl)methyl)piperidin-1-y...)
Affinity DataKi:  5nM. Assay description: Displacement of [3H]-N-alpha-methylhistamine from guinea pig histamine H3 receptor
In DepthDetails ArticlePubMed
TargetCytochrome P450 2D6(Homo sapiens (Human))
The Schering Plough Research Institute
Curated by ChEMBL
LigandPNGBDBM50177544(1-(4-(2-(4-((1H-imidazol-4-yl)methyl)piperidin-1-y...)
Affinity DataIC50:  3.00E+3nM. Assay description: Inhibition of CYP2D6 by human liver microsome assay
In DepthDetails ArticlePubMed