BDBM50177679 CHEMBL3814761
SMILES OC(=O)c1ccccc1NC(=O)c1cccc(NC(=O)Cc2ccccc2)c1
InChI Key InChIKey=OBGIRQUECFHUEY-UHFFFAOYSA-N
Data  2 Kd
  Tab Delimited (TSV)   2D SDfile   Computed 3D by Vconf -m prep SDfile
Find this compound or compounds like it in BindingDB:
Activity Spreadsheet -- Enzyme Inhibition Constant Data from BindingDB
Found 2 hits for monomerid = 50177679
TargetSegment polarity protein dishevelled homolog DVL-1(Homo sapiens (Human))
University College London
Curated by ChEMBL
LigandPNGBDBM50177679(CHEMBL3814761)
Affinity DataKd:  9.54E+5nM. Assay description: Binding affinity to recombinant human Dvl1 PDZ domain assessed as chemical shift change by 1H-15N HSQC NMR spectroscopy analysis
In DepthDetails PubMed
TargetSegment polarity protein dishevelled homolog DVL-1(Homo sapiens (Human))
University College London
Curated by ChEMBL
LigandPNGBDBM50177679(CHEMBL3814761)
Affinity DataKd:  1.06E+4nM. Assay description: Binding affinity to TMR-labeled Dvl-1 PDZ domain (unknown origin) expressed in Escherichia coli by fluorescence spectroscopy
In DepthDetails ArticlePubMed