BDBM50177703 CHEMBL3814879
SMILES Cc1nc(cs1)-c1ccc2N(CCc2c1)S(=O)(=O)c1ccc(CCC(O)=O)cc1
InChI Key InChIKey=BDFPIENDIAMGAX-UHFFFAOYSA-N
Data  2 Kd
  Tab Delimited (TSV)   2D SDfile   Computed 3D by Vconf -m prep SDfile
Find this compound or compounds like it in BindingDB:
Activity Spreadsheet -- Enzyme Inhibition Constant Data from BindingDB
Found 2 hits for monomerid = 50177703
TargetSegment polarity protein dishevelled homolog DVL-1(Homo sapiens (Human))
Yonsei University
Curated by ChEMBL
LigandPNGBDBM50177703(CHEMBL3814879)
Affinity DataKd:  6.24E+4nM. Assay description: Binding affinity to His-tagged Dvl-1 PDZ domain (247 to 337 residues) (unknown origin) expressed in Escherichia coli BL21 (DE3) by SPR analysis
In DepthDetails ArticlePubMed
TargetSegment polarity protein dishevelled homolog DVL-1(Homo sapiens (Human))
Yonsei University
Curated by ChEMBL
LigandPNGBDBM50177703(CHEMBL3814879)
Affinity DataKd:  3.20nM. Assay description: Binding affinity to His-tagged Dvl-1 PDZ domain (247 to 337 residues) (unknown origin) expressed in Escherichia coli BL21 (DE3) assessed as dissociat...
In DepthDetails ArticlePubMed