BDBM50177916 2-cyano-N-{6-[2-cyano-3-(4-hydroxyphenyl)acryloylamino]hexyl}-3-(4-hydroxyphenyl)acrylamide::CHEMBL383809
SMILES Oc1ccc(\C=C(/C#N)C(=O)NCCCCCCNC(=O)C(=C\c2ccc(O)cc2)\C#N)cc1
InChI Key InChIKey=XATBUIUVOUOZCK-YHARCJFQSA-N
Data  1 IC50
  Tab Delimited (TSV)   2D SDfile   Computed 3D by Vconf -m prep SDfile
Find this compound or compounds like it in BindingDB:
Activity Spreadsheet -- Enzyme Inhibition Constant Data from BindingDB
Found 1 hit for monomerid = 50177916
TargetDynamin-1(Homo sapiens (Human))
The University Of Newcastle
Curated by ChEMBL
LigandPNGBDBM50177916(2-cyano-N-{6-[2-cyano-3-(4-hydroxyphenyl)acryloyla...)
Affinity DataIC50: >1.00E+5nM. Assay description: Inhibitory activity against dynamin1 GTPase expressed in sheep brain
In DepthDetails ArticlePubMed