BDBM50177946 2-cyano-N-[2-(2-cyano-3-phenylacryloylamino)ethyl]3-phenylacrylamide::CHEMBL197490
SMILES O=C(NCCNC(=O)C(=C\c1ccccc1)\C#N)C(=C\c1ccccc1)\C#N
InChI Key InChIKey=YFHDJOJKHHDMGT-IWGRKNQJSA-N
Data  1 IC50
  Tab Delimited (TSV)   2D SDfile   Computed 3D by Vconf -m prep SDfile
Find this compound or compounds like it in BindingDB:
Activity Spreadsheet -- Enzyme Inhibition Constant Data from BindingDB
Found 1 hit for monomerid = 50177946
TargetDynamin-1(Homo sapiens (Human))
The University Of Newcastle
Curated by ChEMBL
LigandPNGBDBM50177946(2-cyano-N-[2-(2-cyano-3-phenylacryloylamino)ethyl]...)
Affinity DataIC50: >1.00E+5nM. Assay description: Inhibitory activity against dynamin1 GTPase expressed in sheep brain
In DepthDetails ArticlePubMed