BDBM50177947 2-cyano-N-(3-{[2-cyano-3-(3,4-dihydroxyphenyl)acryloyl]methylamino}propyl)-3-(3,4-dihydroxyphenyl)-N-methylacrylamide::CHEMBL197425
SMILES CN(CCCN(C)C(=O)C(=C\c1ccc(O)c(O)c1)\C#N)C(=O)C(=C\c1ccc(O)c(O)c1)\C#N
InChI Key InChIKey=GQZOWRWREADQEZ-XOBNHNQQSA-N
Data  1 IC50
  Tab Delimited (TSV)   2D SDfile   Computed 3D by Vconf -m prep SDfile
Find this compound or compounds like it in BindingDB:
Activity Spreadsheet -- Enzyme Inhibition Constant Data from BindingDB
Found 1 hit for monomerid = 50177947
TargetDynamin-1(Homo sapiens (Human))
The University Of Newcastle
Curated by ChEMBL
LigandPNGBDBM50177947(2-cyano-N-(3-{[2-cyano-3-(3,4-dihydroxyphenyl)acry...)
Affinity DataIC50: >1.00E+5nM. Assay description: Inhibitory activity against dynamin1 GTPase expressed in sheep brain
In DepthDetails ArticlePubMed