BDBM50177971 2-cyano-N-{2-[2-cyano-3-(3-hydroxy-4-methoxyphenyl)acryloylamino]ethyl}-3-(3-hydroxy-4-methoxyphenyl)acrylamide::CHEMBL380566
SMILES COc1ccc(\C=C(/C#N)C(=O)NCCNC(=O)C(=C\c2ccc(OC)c(O)c2)\C#N)cc1O
InChI Key InChIKey=OSDQZQDJEULTLL-BEQMOXJMSA-N
Data  1 IC50
  Tab Delimited (TSV)   2D SDfile   Computed 3D by Vconf -m prep SDfile
Find this compound or compounds like it in BindingDB:
Activity Spreadsheet -- Enzyme Inhibition Constant Data from BindingDB
Found 1 hit for monomerid = 50177971
TargetDynamin-1(Homo sapiens (Human))
The University Of Newcastle
Curated by ChEMBL
LigandPNGBDBM50177971(2-cyano-N-{2-[2-cyano-3-(3-hydroxy-4-methoxyphenyl...)
Affinity DataIC50: >1.00E+5nM. Assay description: Inhibitory activity against dynamin1 GTPase expressed in sheep brain
In DepthDetails ArticlePubMed