BDBM50178269 CHEMBL382848::N-((2-(2-cyclopropoxy-5-(trifluoromethoxy)benzylamino)-1-(4-fluorophenyl)-8-aza-bicyclo[3.2.1]octan-6-yl)methyl)methanesulfonamide
SMILES CS(=O)(=O)NCC1CC2(NC1CCC2NCc1cc(OC(F)(F)F)ccc1OC1CC1)c1ccc(F)cc1
InChI Key InChIKey=NUTYWRAIFXRNNI-UHFFFAOYSA-N
Data  1 KI  1 IC50
  Tab Delimited (TSV)   2D SDfile   Computed 3D by Vconf -m prep SDfile
Find this compound or compounds like it in BindingDB:
Activity Spreadsheet -- Enzyme Inhibition Constant Data from BindingDB
Found 2 hits for monomerid = 50178269
TargetPotassium voltage-gated channel subfamily H member 2(Homo sapiens (Human))
Merck Sharp & Dohme Research Laboratories
Curated by ChEMBL
LigandPNGBDBM50178269(CHEMBL382848 | N-((2-(2-cyclopropoxy-5-(trifluorom...)
Affinity DataKi:  420nM. Assay description: Displacement of [35S]-labelled MK499 from cloned hERG potassium channel expressed in HEK cells
In DepthDetails ArticlePubMed
TargetSubstance-P receptor(Homo sapiens (Human))
Merck Sharp & Dohme Research Laboratories
Curated by ChEMBL
LigandPNGBDBM50178269(CHEMBL382848 | N-((2-(2-cyclopropoxy-5-(trifluorom...)
Affinity DataIC50:  0.0900nM. Assay description: Displacement of [125I]-labelled substance P from cloned human NK1 receptor expressed in CHO cells
In DepthDetails ArticlePubMed