BDBM50178855 CHEMBL206225::trans-N-(3,5-dichlorobenzyl)-2-(1-hydroxy-3-(4-methoxyphenyl)propyl)cyclopentanecarboxamide
SMILES COc1ccc(CCC(O)[C@@H]2CCC[C@H]2C(=O)NCc2cc(Cl)cc(Cl)c2)cc1
InChI Key InChIKey=LZRBUCARILGKPQ-JAZPPYFYSA-N
Data  1 KI
  Tab Delimited (TSV)   2D SDfile   Computed 3D by Vconf -m prep SDfile
Find this compound or compounds like it in BindingDB:
Activity Spreadsheet -- Enzyme Inhibition Constant Data from BindingDB
Found 1 hit for monomerid = 50178855
TargetSodium channel protein type 9 subunit alpha(Homo sapiens (Human))
Merck Research Laboratories
Curated by ChEMBL
LigandPNGBDBM50178855(CHEMBL206225 | trans-N-(3,5-dichlorobenzyl)-2-(1-h...)
Affinity DataKi:  1.21E+3nM. Assay description: Inhibition of peripheral nerve sodium channel NaV1.7
In DepthDetails ArticlePubMed