BDBM50178864 CHEMBL204399::N-((trans-2-(1-hydroxy-3-phenylpropyl)cyclopentyl)methyl)-4-(trifluoromethoxy)benzenesulfonamide
SMILES OC(CCc1ccccc1)[C@@H]1CCC[C@H]1CNS(=O)(=O)c1ccc(OC(F)(F)F)cc1
InChI Key InChIKey=GGNWFVGMQOIJNH-DVUUQMMQSA-N
Data  1 KI
  Tab Delimited (TSV)   2D SDfile   Computed 3D by Vconf -m prep SDfile
Find this compound or compounds like it in BindingDB:
Activity Spreadsheet -- Enzyme Inhibition Constant Data from BindingDB
Found 1 hit for monomerid = 50178864
TargetSodium channel protein type 9 subunit alpha(Homo sapiens (Human))
Merck Research Laboratories
Curated by ChEMBL
LigandPNGBDBM50178864(CHEMBL204399 | N-((trans-2-(1-hydroxy-3-phenylprop...)
Affinity DataKi:  630nM. Assay description: Inhibition of peripheral nerve sodium channel NaV1.7
In DepthDetails ArticlePubMed