BDBM50179142 (R)-1,2,3,4-tetrahydro-isoquinoline-3-carboxylic acid {(R)-1-(4-chloro-benzyl)-2-[4-cyclohexyl-4-(1,1-dioxo-1lambda*6*-isothiazolidin-2-ylmethyl)-piperidin-1-yl]-2-oxo-ethyl}-amide::CHEMBL203975
SMILES Clc1ccc(C[C@@H](NC(=O)[C@H]2Cc3ccccc3CN2)C(=O)N2CCC(CN3CCCS3(=O)=O)(CC2)C2CCCCC2)cc1
InChI Key InChIKey=DTYOAGHBUMBHBH-FIRIVFDPSA-N
Data  4 IC50  4 EC50
  Tab Delimited (TSV)   2D SDfile   Computed 3D by Vconf -m prep SDfile
Find this compound or compounds like it in BindingDB:
Activity Spreadsheet -- Enzyme Inhibition Constant Data from BindingDB
Found 8 hits for monomerid = 50179142
TargetMelanocortin receptor 3(Homo sapiens (Human))
Merck Research Laboratories
Curated by ChEMBL
LigandPNGBDBM50179142((R)-1,2,3,4-tetrahydro-isoquinoline-3-carboxylic a...)
Affinity DataEC50:  540nM. Assay description: Activity against human MC3R by cAMP accumulation
In DepthDetails ArticlePubMed
TargetMelanocortin receptor 4(Homo sapiens (Human))
Merck Research Laboratories
Curated by ChEMBL
LigandPNGBDBM50179142((R)-1,2,3,4-tetrahydro-isoquinoline-3-carboxylic a...)
Affinity DataEC50:  5.30nM. Assay description: Activity against human MC4R by cAMP accumulation
In DepthDetails ArticlePubMed
TargetMelanocortin receptor 5(Homo sapiens (Human))
Merck Research Laboratories
Curated by ChEMBL
LigandPNGBDBM50179142((R)-1,2,3,4-tetrahydro-isoquinoline-3-carboxylic a...)
Affinity DataIC50:  170nM. Assay description: Displacement of [125I]NDP-alpha-MSH from human MC5R expressed in CHO cells
In DepthDetails ArticlePubMed
TargetMelanocortin receptor 4(Homo sapiens (Human))
Merck Research Laboratories
Curated by ChEMBL
LigandPNGBDBM50179142((R)-1,2,3,4-tetrahydro-isoquinoline-3-carboxylic a...)
Affinity DataIC50:  0.910nM. Assay description: Activity against human MC4R by cAMP accumulation
In DepthDetails ArticlePubMed
TargetMelanocortin receptor 3(Homo sapiens (Human))
Merck Research Laboratories
Curated by ChEMBL
LigandPNGBDBM50179142((R)-1,2,3,4-tetrahydro-isoquinoline-3-carboxylic a...)
Affinity DataIC50:  310nM. Assay description: Displacement of [125I]NDP-alpha-MSH from human MC3R expressed in CHO cells
In DepthDetails ArticlePubMed
TargetMelanocyte-stimulating hormone receptor(Homo sapiens (Human))
Merck Research Laboratories
Curated by ChEMBL
LigandPNGBDBM50179142((R)-1,2,3,4-tetrahydro-isoquinoline-3-carboxylic a...)
Affinity DataEC50:  680nM. Assay description: Activity against human MC1BR by cAMP accumulation
In DepthDetails ArticlePubMed
TargetMelanocortin receptor 5(Homo sapiens (Human))
Merck Research Laboratories
Curated by ChEMBL
LigandPNGBDBM50179142((R)-1,2,3,4-tetrahydro-isoquinoline-3-carboxylic a...)
Affinity DataEC50:  660nM. Assay description: Activity against human MC5R by cAMP accumulation
In DepthDetails ArticlePubMed
TargetMelanocyte-stimulating hormone receptor(Homo sapiens (Human))
Merck Research Laboratories
Curated by ChEMBL
LigandPNGBDBM50179142((R)-1,2,3,4-tetrahydro-isoquinoline-3-carboxylic a...)
Affinity DataIC50:  1.30E+3nM. Assay description: Displacement of [125I]NDP-alpha-MSH from human MC1BR expressed in CHO cells
In DepthDetails ArticlePubMed