BDBM50179199 5'-O-{11-[3',17'beta-dihydroxy-1',3',5'(10')-estratrien-16'alpha/beta-yl]-undecanoyl} adenosine::CHEMBL382114
SMILES C[C@]12CC[C@H]3[C@@H](CCc4cc(O)ccc34)[C@@H]1CC(CCCCCCCCCCC(=O)OC[C@H]1O[C@H]([C@H](O)[C@@H]1O)n1cnc3c(N)ncnc13)[C@@H]2O
InChI Key InChIKey=DPLBFKGCEFASTL-FNFZMYQISA-N
Data  1 IC50
  Tab Delimited (TSV)   2D SDfile   Computed 3D by Vconf -m prep SDfile
Find this compound or compounds like it in BindingDB:
Activity Spreadsheet -- Enzyme Inhibition Constant Data from BindingDB
Found 1 hit for monomerid = 50179199
Target17-beta-hydroxysteroid dehydrogenase type 1(Homo sapiens (Human))
Chuq-Pavillon Chul And Université
Curated by ChEMBL
LigandPNGBDBM50179199(5'-O-{11-[3',17'beta-dihydroxy-1',3',5'(10')-estra...)
Affinity DataIC50:  90nM. Assay description: Inhibitory activity against type 1 17beta-HSD expressed in transfected HEK293 cells
In DepthDetails ArticlePubMed