BDBM50179212 3-chloro-N-(6,7-dimethoxy-2,4-dihydroindeno[1,2-c]pyrazol-3-yl)phenylamine::CHEMBL200735
SMILES COc1cc2Cc3c(Nc4cccc(Cl)c4)[nH]nc3-c2cc1OC
InChI Key InChIKey=WVDRRFJDEHTKNN-UHFFFAOYSA-N
Data  2 IC50
  Tab Delimited (TSV)   2D SDfile   Computed 3D by Vconf -m prep SDfile
Find this compound or compounds like it in BindingDB:
Activity Spreadsheet -- Enzyme Inhibition Constant Data from BindingDB
Found 2 hits for monomerid = 50179212
TargetPlatelet-derived growth factor receptor beta(Homo sapiens (Human))
Johnson & Johnson Pharmaceutical Research And Development
Curated by ChEMBL
LigandPNGBDBM50179212(3-chloro-N-(6,7-dimethoxy-2,4-dihydroindeno[1,2-c]...)
Affinity DataIC50:  3nM. Assay description: Inhibitory activity against PDGFRbeta kinase
In DepthDetails ArticlePubMed
TargetPlatelet-derived growth factor receptor beta(Homo sapiens (Human))
Johnson & Johnson Pharmaceutical Research And Development
Curated by ChEMBL
LigandPNGBDBM50179212(3-chloro-N-(6,7-dimethoxy-2,4-dihydroindeno[1,2-c]...)
Affinity DataIC50:  268nM. Assay description: Antiproliferative activity against PDGF-BB stimulated HCASMC
In DepthDetails ArticlePubMed