BDBM50179268 1-(3-(6-methoxynaphthalen-1-yl)propyl)-4-methylpiperidine hydrochloride::CHEMBL559178
SMILES COc1ccc2c(CCCN3CCC(C)CC3)cccc2c1
InChI Key InChIKey=CNQCQSTYGIBMDY-UHFFFAOYSA-N
Data  2 KI
  Tab Delimited (TSV)   2D SDfile   Computed 3D by Vconf -m prep SDfile
Find this compound or compounds like it in BindingDB:
Activity Spreadsheet -- Enzyme Inhibition Constant Data from BindingDB
Found 2 hits for monomerid = 50179268
TargetSigma non-opioid intracellular receptor 1(Cavia porcellus (Guinea pig))
Universit£
Curated by ChEMBL
LigandPNGBDBM50179268(1-(3-(6-methoxynaphthalen-1-yl)propyl)-4-methylpip...)
Affinity DataKi:  1.5nM. Assay description: Displacement of [3H](+)-pentazocine from sigma 1 receptor in guinea pig brain membranes
In DepthDetails ArticlePubMed
Target3-beta-hydroxysteroid-Delta(8),Delta(7)-isomerase(Cavia porcellus)
Universit£
Curated by ChEMBL
LigandPNGBDBM50179268(1-(3-(6-methoxynaphthalen-1-yl)propyl)-4-methylpip...)
Affinity DataKi:  19.5nM. Assay description: Displacement of [3H](+/-)-emopamil from delta8-delta7 sterol isomerase (SI) site in guinea pig liver membranes
In DepthDetails ArticlePubMed