BDBM50179271 1-(4-(6-methoxynaphthalen-1-yl)butyl)piperidine::CHEMBL175560::CHEMBL535366
SMILES COc1ccc2c(CCCCN3CCCCC3)cccc2c1
InChI Key InChIKey=CBIFCMWSKGBMDI-UHFFFAOYSA-N
Data  2 KI  1 EC50
  Tab Delimited (TSV)   2D SDfile   Computed 3D by Vconf -m prep SDfile
Find this compound or compounds like it in BindingDB:
Activity Spreadsheet -- Enzyme Inhibition Constant Data from BindingDB
Found 3 hits for monomerid = 50179271
TargetSigma non-opioid intracellular receptor 1(Cavia porcellus (Guinea pig))
Universit£
Curated by ChEMBL
LigandPNGBDBM50179271(1-(4-(6-methoxynaphthalen-1-yl)butyl)piperidine | ...)
Affinity DataKi:  1.14nM. Assay description: Displacement of [3H](+)-pentazocine from sigma 1 receptor in guinea pig brain membranes
In DepthDetails ArticlePubMed
Target3-beta-hydroxysteroid-Delta(8),Delta(7)-isomerase(Cavia porcellus)
Universit£
Curated by ChEMBL
LigandPNGBDBM50179271(1-(4-(6-methoxynaphthalen-1-yl)butyl)piperidine | ...)
Affinity DataKi:  19.5nM. Assay description: Displacement of [3H](+/-)-emopamil from delta8-delta7 sterol isomerase (SI) site in guinea pig liver membranes
In DepthDetails ArticlePubMed
TargetSigma non-opioid intracellular receptor 1(RAT)
Universit£
Curated by ChEMBL
LigandPNGBDBM50179271(1-(4-(6-methoxynaphthalen-1-yl)butyl)piperidine | ...)
Affinity DataEC50:  1.94E+4nM. Assay description: Antiproliferative activity mediated by sigma 1 receptor in rat C6 glioma cells by MTT assay
In DepthDetails ArticlePubMed