BDBM50179473 2-((2-(6-(4-tert-butylphenyl)pyridin-2-yl)-1H-benzo[d]imidazol-5-yl)methyl)malonic acid::CHEMBL202796
SMILES CC(C)(C)c1ccc(cc1)-c1cccc(n1)-c1nc2ccc(CC(C(O)=O)C(O)=O)cc2[nH]1
InChI Key InChIKey=IZLPISHIQSVOSP-UHFFFAOYSA-N
Data  1 EC50
  Tab Delimited (TSV)   2D SDfile   Computed 3D by Vconf -m prep SDfile
Find this compound or compounds like it in BindingDB:
Activity Spreadsheet -- Enzyme Inhibition Constant Data from BindingDB
Found 1 hit for monomerid = 50179473
TargetThrombopoietin receptor(Homo sapiens (Human))
Glaxosmithkline
Curated by ChEMBL
LigandPNGBDBM50179473(2-((2-(6-(4-tert-butylphenyl)pyridin-2-yl)-1H-benz...)
Affinity DataEC50:  1.00E+4nM. Assay description: Agonist activity as induced proliferation in Ba/F3-hTpoR murine lymphocyte expressing human TPOR
In DepthDetails ArticlePubMed