BDBM50179693 (S)-2-amino-4-(ethylthio)butanoic acid::2-AMINO-4-ETHYL SULFANYL BUTYRIC ACID::CHEMBL203187
SMILES CCSCC[C@H](N)C(O)=O
InChI Key InChIKey=GGLZPLKKBSSKCX-YFKPBYRVSA-N
Data  1 KI
PDB links: 1 PDB ID matches this monomer.
  Tab Delimited (TSV)   2D SDfile   Computed 3D by Vconf -m prep SDfile
Find this compound or compounds like it in BindingDB:
Activity Spreadsheet -- Enzyme Inhibition Constant Data from BindingDB
Found 1 hit for monomerid = 50179693
TargetVoltage-dependent calcium channel subunit alpha-2/delta-1(Mus musculus)
Abbott Laboratories
Curated by ChEMBL
LigandPNGBDBM50179693((S)-2-amino-4-(ethylthio)butanoic acid | 2-AMINO-4...)
Affinity DataKi:  100nM. Assay description: Displacement of [3H]L-leucine from alpha2delta containing calcium channel in murine brain
In DepthDetails ArticlePubMed