BDBM50179738 CHEMBL203244::N-((S)-1-((S)-1-((3S)-2-hydroxy-tetrahydrofuran-3-ylamino)-4-methyl-1-oxopentan-2-ylamino)-4-methyl-1-oxopentan-2-yl)-10H-phenothiazine-2-carboxamide
SMILES CC(C)C[C@H](NC(=O)[C@H](CC(C)C)NC(=O)c1ccc2Sc3ccccc3Nc2c1)C(=O)N[C@H]1CCOC1O
InChI Key InChIKey=OIXYHRZFKWJACP-SFGTWLEPSA-N
Data  1 IC50
  Tab Delimited (TSV)   2D SDfile   Computed 3D by Vconf -m prep SDfile
Find this compound or compounds like it in BindingDB:
Activity Spreadsheet -- Enzyme Inhibition Constant Data from BindingDB
Found 1 hit for monomerid = 50179738
TargetCalpain small subunit 1/1 catalytic subunit(Homo sapiens (Human))
Institut Henri Beaufour
Curated by ChEMBL
LigandPNGBDBM50179738(CHEMBL203244 | N-((S)-1-((S)-1-((3S)-2-hydroxy-tet...)
Affinity DataIC50:  85.5nM. Assay description: Inhibition of isolated human calpain1
In DepthDetails ArticlePubMed