BDBM50179922 4-(2-fluoro-5-(3-(2-hydroxypropan-2-yl)imidazo[1,2-b][1,2,4]triazin-7-yl)phenyl)pyrimidine-5-carbonitrile::CHEMBL380730
SMILES CC(C)(O)c1cnn2c(cnc2n1)-c1ccc(F)c(c1)-c1ncncc1C#N
InChI Key InChIKey=VSZZYAJBIGSJJF-UHFFFAOYSA-N
Data  2 KI
  Tab Delimited (TSV)   2D SDfile   Computed 3D by Vconf -m prep SDfile
Find this compound or compounds like it in BindingDB:
Activity Spreadsheet -- Enzyme Inhibition Constant Data from BindingDB
Found 2 hits for monomerid = 50179922
TargetGamma-aminobutyric acid receptor subunit alpha-1/beta-3/gamma-2(Homo sapiens (Human))
Merck Sharp And Dohme Research Laboratories
Curated by ChEMBL
LigandPNGBDBM50179922(4-(2-fluoro-5-(3-(2-hydroxypropan-2-yl)imidazo[1,2...)
Affinity DataKi:  0.670nM. Assay description: Displacement of [3H]Ro 15-1788 from recombinant human GABA-Aalpha1 receptor plus beta3gamma2 expressed in mouse L(tk-) cells
Target InfoGoogleScholar
In DepthDetails ArticlePubMed
TargetGamma-aminobutyric acid receptor subunit alpha-3/beta-3/gamma-2(Homo sapiens (Human))
Merck Sharp And Dohme Research Laboratories
Curated by ChEMBL
LigandPNGBDBM50179922(4-(2-fluoro-5-(3-(2-hydroxypropan-2-yl)imidazo[1,2...)
Affinity DataKi:  3.30nM. Assay description: Displacement of [3H]Ro 15-1788 from recombinant human GABA-Aalpha3 receptor plus beta3gamma2 expressed in L(tk-) cells
In DepthDetails ArticlePubMed