BDBM50180165 CHEMBL3813722
SMILES [H][C@]1(NC(=O)[C@H](Cc2ccc(O)cc2)NC(=O)[C@@H](N)CSSC[C@H](NC(=O)[C@H](CC(N)=O)NC(=O)[C@H](CCC(N)=O)NC1=O)C(=O)N1CCC[C@H]1C(=O)N(C)[C@@H](CC(C)C)C(=O)N(C)CC(N)=O)[C@@H](C)CC
InChI Key InChIKey=HJFYLQCHGURFIF-XTDTXPIQSA-N
Data  1 KI  1 EC50
  Tab Delimited (TSV)   2D SDfile   Computed 3D by Vconf -m prep SDfile
Find this compound or compounds like it in BindingDB:
Activity Spreadsheet -- Enzyme Inhibition Constant Data from BindingDB
Found 2 hits for monomerid = 50180165
TargetOxytocin receptor(Homo sapiens (Human))
Pfizer
Curated by ChEMBL
LigandPNGBDBM50180165(CHEMBL3813722)
Affinity DataKi:  11nM. Assay description: Displacement of [3H]8-arginine-vasopressin from human oxytocin receptor expressed in CHO cell membrane incubated for 1 hr by liquid scintillation cou...
In DepthDetails ArticlePubMed
TargetOxytocin receptor(Homo sapiens (Human))
Pfizer
Curated by ChEMBL
LigandPNGBDBM50180165(CHEMBL3813722)
Affinity DataEC50:  5.5nM. Assay description: Agonist activity at human oxytocin receptor expressed in CHO cells assessed as increase in intracellular calcium flux measured for 90 sec by fluo-4 d...
In DepthDetails ArticlePubMed