BDBM50180589 CHEMBL3814533
SMILES OC1=C(CCC\C1=C/c1ccccc1F)C(=O)c1ccccc1
InChI Key InChIKey=YXXXBUVLSNPPNF-DTQAZKPQSA-N
Data  1 IC50
  Tab Delimited (TSV)   2D SDfile   Computed 3D by Vconf -m prep SDfile
Find this compound or compounds like it in BindingDB:
Activity Spreadsheet -- Enzyme Inhibition Constant Data from BindingDB
Found 1 hit for monomerid = 50180589
TargetAcetylcholinesterase(Electrophorus electricus (Electric eel))
Universiti Putra Malaysia
Curated by ChEMBL
LigandPNGBDBM50180589(CHEMBL3814533)
Affinity DataIC50:  6.60E+3nM. Assay description: Inhibition of electric eel AChE preincubated for 15 mins followed by addition of acetylthiocholine iodide as substrate measured after 30 mins by Ellm...
In DepthDetails ArticlePubMed