BDBM50180612 CHEMBL3814991
SMILES Cc1ccc(\C=C2/CCCC(C(=O)c3ccccc3)=C2O)cc1
InChI Key InChIKey=QASTZMUOEVBVJT-NBVRZTHBSA-N
Data  1 IC50
  Tab Delimited (TSV)   2D SDfile   Computed 3D by Vconf -m prep SDfile
Find this compound or compounds like it in BindingDB:
Activity Spreadsheet -- Enzyme Inhibition Constant Data from BindingDB
Found 1 hit for monomerid = 50180612
TargetAcetylcholinesterase(Electrophorus electricus (Electric eel))
Universiti Putra Malaysia
Curated by ChEMBL
LigandPNGBDBM50180612(CHEMBL3814991)
Affinity DataIC50:  8.50E+3nM. Assay description: Inhibition of electric eel AChE preincubated for 15 mins followed by addition of acetylthiocholine iodide as substrate measured after 30 mins by Ellm...
In DepthDetails ArticlePubMed