BDBM50180620 CHEMBL3814587
SMILES OC1=C(CCC\C1=C/c1cccc(OCCN2CCCCC2)c1)C(=O)c1ccccc1
InChI Key InChIKey=SPJJRELPSVANFD-FCDQGJHFSA-N
Data  2 IC50
  Tab Delimited (TSV)   2D SDfile   Computed 3D by Vconf -m prep SDfile
Find this compound or compounds like it in BindingDB:
Activity Spreadsheet -- Enzyme Inhibition Constant Data from BindingDB
Found 2 hits for monomerid = 50180620
TargetCholinesterase(Equus caballus (Horse))
Universiti Putra Malaysia
Curated by ChEMBL
LigandPNGBDBM50180620(CHEMBL3814587)
Affinity DataIC50:  1.40E+3nM. Assay description: Inhibition of equine serum BChE preincubated for 15 mins followed by addition of S-butyrylthiocholine iodide as substrate measured after 30 mins by E...
In DepthDetails ArticlePubMed
TargetAcetylcholinesterase(Electrophorus electricus (Electric eel))
Universiti Putra Malaysia
Curated by ChEMBL
LigandPNGBDBM50180620(CHEMBL3814587)
Affinity DataIC50:  3.10E+3nM. Assay description: Inhibition of electric eel AChE preincubated for 15 mins followed by addition of acetylthiocholine iodide as substrate measured after 30 mins by Ellm...
In DepthDetails ArticlePubMed