BDBM50180747 2-pyridin-2-yl-1H-imidazo[4,5-c]pyridine::CHEMBL202826
SMILES c1ccc(nc1)-c1nc2ccncc2[nH]1
InChI Key InChIKey=RCQLXXHLXWNHOU-UHFFFAOYSA-N
Data  3 IC50
  Tab Delimited (TSV)   2D SDfile   Computed 3D by Vconf -m prep SDfile
Find this compound or compounds like it in BindingDB:
Activity Spreadsheet -- Enzyme Inhibition Constant Data from BindingDB
Found 3 hits for monomerid = 50180747
TargetMethionine aminopeptidase(Escherichia coli (strain K12))
Saarland University
Curated by ChEMBL
LigandPNGBDBM50180747(2-pyridin-2-yl-1H-imidazo[4,5-c]pyridine | CHEMBL2...)
Affinity DataIC50:  550nM. Assay description: Inhibition of Co2+ loaded MetAP expressed in Escherichia coli
In DepthDetails ArticlePubMed
TargetMethionine aminopeptidase 2(Homo sapiens (Human))
Universit£T Heidelberg
Curated by ChEMBL
LigandPNGBDBM50180747(2-pyridin-2-yl-1H-imidazo[4,5-c]pyridine | CHEMBL2...)
Affinity DataIC50:  8.00E+3nM. Assay description: Inhibition of human MetAP2 expressed in baculovirus infected Sf9 cells
In DepthDetails ArticlePubMed
TargetMethionine aminopeptidase 1(Homo sapiens (Human))
Universit£T Heidelberg
Curated by ChEMBL
LigandPNGBDBM50180747(2-pyridin-2-yl-1H-imidazo[4,5-c]pyridine | CHEMBL2...)
Affinity DataIC50:  1.03E+4nM. Assay description: Inhibition of human MetAP1
In DepthDetails ArticlePubMed