BDBM50180968 CHEMBL3818080
SMILES CCN([C@H]1CN(N=C1c1ccc(Cl)c(Cl)c1)C(\Nc1ccc(Cl)c(OC(F)F)c1)=N/C#N)C(=O)CO
InChI Key InChIKey=GAPYHYWZUSFPBS-KRWDZBQOSA-N
Data  1 IC50
  Tab Delimited (TSV)   2D SDfile   Computed 3D by Vconf -m prep SDfile
Find this compound or compounds like it in BindingDB:
Activity Spreadsheet -- Enzyme Inhibition Constant Data from BindingDB
Found 1 hit for monomerid = 50180968
TargetN-lysine methyltransferase SMYD2(Homo sapiens (Human))
Bayer Pharma
Curated by ChEMBL
LigandPNGBDBM50180968(CHEMBL3818080)
Affinity DataIC50:  44nM. Assay description: Inhibition of SMYD2 (unknown origin) using H4 as substrate after 2hrs in presence 3H-SAM of by scintillation proximity assay
In DepthDetails ArticlePubMed